BDBM50252035 CHEMBL4064361
SMILES COc1cc(Br)c(\C=C2/CN(C)C/C(=C\c3nc(C)c(C)nc3C)/C/2=N\O)cc1OC
InChI Key InChIKey=DOULSNZNYVKSOU-QLCCHTHISA-N
Data  2 IC50
  Tab Delimited (TSV)   2D SDfile   Computed 3D by Vconf -m prep SDfile
Find this compound or compounds like it in BindingDB:
Activity Spreadsheet -- Enzyme Inhibition Constant Data from BindingDB
Found 2 hits for monomerid = 50252035
TargetFocal adhesion kinase 1(Homo sapiens (Human))
Wuhan University of Technology
Curated by ChEMBL
LigandPNGBDBM50252035(CHEMBL4064361)
Affinity DataIC50:  1.90E+3nM. Assay description: Inhibition of FAK (unknown origin) assembly preincubated with enzyme followed by GTP addition measured after 20 mins by spectrophotometric analysis
In DepthDetails ArticlePubMed
TargetEpidermal growth factor receptor(Homo sapiens (Human))
Wuhan University of Technology
Curated by ChEMBL
LigandPNGBDBM50252035(CHEMBL4064361)
Affinity DataIC50:  20nM. Assay description: Inhibition of His6-tagged recombinant EGFR cytoplasmic domain (unknown origin) (645 to 1186 residues) expressed in baculovirus infected Sf-9 cells pr...
In DepthDetails ArticlePubMed