BDBM50252229 CHEMBL4063921
SMILES CNC(=O)c1ccc2[nH]c(nc2c1)-c1ccc(Oc2c(c(C)nn2-c2ccccc2)[N+]([O-])=O)cc1
InChI Key InChIKey=HYKIPVYXJHYHMK-UHFFFAOYSA-N
Data  1 IC50
  Tab Delimited (TSV)   2D SDfile   Computed 3D by Vconf -m prep SDfile
Find this compound or compounds like it in BindingDB:
Activity Spreadsheet -- Enzyme Inhibition Constant Data from BindingDB
Found 1 hit for monomerid = 50252229
TargetSerine/threonine-protein kinase Chk2(Homo sapiens (Human))
National Research Centre
Curated by ChEMBL
LigandPNGBDBM50252229(CHEMBL4063921)
Affinity DataIC50:  15nM. Assay description: Inhibition of Chk2 (unknown origin) by ELISA based spectrophotometric analysis
In DepthDetails ArticlePubMed