BDBM50252308 CHEMBL4065452
SMILES C(COc1ccc(cc1)-c1nc2ccc(OCCCN3CCCC3)cc2o1)CN1CCCC1
InChI Key InChIKey=YMYJXFUPMPMETB-UHFFFAOYSA-N
Data  6 IC50
  Tab Delimited (TSV)   2D SDfile   Computed 3D by Vconf -m prep SDfile
Find this compound or compounds like it in BindingDB:
Activity Spreadsheet -- Enzyme Inhibition Constant Data from BindingDB
Found 6 hits for monomerid = 50252308
TargetToll-like receptor 7(Homo sapiens (Human))
Csir-Indian Institute of Chemical Biology
Curated by ChEMBL
LigandPNGBDBM50252308(CHEMBL4065452)
Affinity DataIC50:  1.99E+3nM. Assay description: Antagonist activity at human TLR7 expressed in HEK293 cells assessed as inhibition of CL264-induced NF-kappaB activation after 24 hrs by spectrophoto...
In DepthDetails ArticlePubMed
TargetToll-like receptor 9(Homo sapiens (Human))
Csir-Indian Institute of Chemical Biology
Curated by ChEMBL
LigandPNGBDBM50252308(CHEMBL4065452)
Affinity DataIC50: <50nM. Assay description: Antagonist activity at TLR9 in human plasmacytoid dendritic cells assessed as inhibition of CpGA-induced IFN-alpha production after 18 hrs by ELISA
In DepthDetails ArticlePubMed
TargetToll-like receptor 9(Homo sapiens (Human))
Csir-Indian Institute of Chemical Biology
Curated by ChEMBL
LigandPNGBDBM50252308(CHEMBL4065452)
Affinity DataIC50:  11nM. Assay description: Antagonist activity at AT1 receptor in rat aortic rings
In DepthDetails PubMed
TargetToll-like receptor 9(Homo sapiens (Human))
Csir-Indian Institute of Chemical Biology
Curated by ChEMBL
LigandPNGBDBM50252308(CHEMBL4065452)
Affinity DataIC50: <50nM. Assay description: Antagonist activity at TLR9 in human PBMC assessed as inhibition of CpGA-induced IFN-alpha production after 18 hrs by ELISA
In DepthDetails ArticlePubMed
TargetToll-like receptor 7(Homo sapiens (Human))
Csir-Indian Institute of Chemical Biology
Curated by ChEMBL
LigandPNGBDBM50252308(CHEMBL4065452)
Affinity DataIC50:  1.55E+3nM. Assay description: Antagonist activity at TLR7 (unknown origin)
In DepthDetails ArticlePubMed
TargetToll-like receptor 9(Homo sapiens (Human))
Csir-Indian Institute of Chemical Biology
Curated by ChEMBL
LigandPNGBDBM50252308(CHEMBL4065452)
Affinity DataIC50:  15nM. Assay description: Inhibition of recombinant full length Anopheles gambiae AChE1 expressed in baculovirus-infected Sf9 insect cells using acetylthiocholine iodide as su...
In DepthDetails ArticlePubMed