BDBM50253564 2-(5-fluoro-2-phenyl-1H-indol-3-yl)-2-oxo-N,N-dipropylacetamide::CHEMBL492256
SMILES CCCN(CCC)C(=O)C(=O)c1c([nH]c2ccc(F)cc12)-c1ccccc1
InChI Key InChIKey=AWYOLAFRSHQHCT-UHFFFAOYSA-N
Data  1 KI
  Tab Delimited (TSV)   2D SDfile   Computed 3D by Vconf -m prep SDfile
Find this compound or compounds like it in BindingDB:
Activity Spreadsheet -- Enzyme Inhibition Constant Data from BindingDB
Found 1 hit for monomerid = 50253564
TargetTranslocator protein(Rattus norvegicus (rat))
Universit£
Curated by ChEMBL
LigandPNGBDBM50253564(2-(5-fluoro-2-phenyl-1H-indol-3-yl)-2-oxo-N,N-dipr...)
Affinity DataKi:  2.67nM. Assay description: Displacement of [3H]PK11195 from translocator protein in rat kidney mitochondrial membrane
In DepthDetails ArticlePubMed