BDBM50253649 CHEMBL461214::N,N-dibutyl-2-(7-methyl-2-phenyl-1H-indol-3-yl)-2-oxoacetamide
SMILES CCCCN(CCCC)C(=O)C(=O)c1c([nH]c2c(C)cccc12)-c1ccccc1
InChI Key InChIKey=BEGPLJDQQUJERJ-UHFFFAOYSA-N
Data  1 KI
  Tab Delimited (TSV)   2D SDfile   Computed 3D by Vconf -m prep SDfile
Find this compound or compounds like it in BindingDB:
Activity Spreadsheet -- Enzyme Inhibition Constant Data from BindingDB
Found 1 hit for monomerid = 50253649
TargetTranslocator protein(Rattus norvegicus (rat))
Universit£
Curated by ChEMBL
LigandPNGBDBM50253649(CHEMBL461214 | N,N-dibutyl-2-(7-methyl-2-phenyl-1H...)
Affinity DataKi:  6nM. Assay description: Displacement of [3H]PK11195 from translocator protein in rat kidney mitochondrial membrane
In DepthDetails ArticlePubMed