BDBM50253813 CHEMBL461638::N-benzyl-2-(7-chloro-2-phenyl-1H-indol-3-yl)-N-ethyl-2-oxoacetamide
SMILES CCN(Cc1ccccc1)C(=O)C(=O)c1c([nH]c2c(Cl)cccc12)-c1ccccc1
InChI Key InChIKey=ZNMZVBFKVVRPET-UHFFFAOYSA-N
Data  1 KI
  Tab Delimited (TSV)   2D SDfile   Computed 3D by Vconf -m prep SDfile
Find this compound or compounds like it in BindingDB:
Activity Spreadsheet -- Enzyme Inhibition Constant Data from BindingDB
Found 1 hit for monomerid = 50253813
TargetTranslocator protein(Rattus norvegicus (rat))
Universit£
Curated by ChEMBL
LigandPNGBDBM50253813(CHEMBL461638 | N-benzyl-2-(7-chloro-2-phenyl-1H-in...)
Affinity DataKi:  5nM. Assay description: Displacement of [3H]PK11195 from translocator protein in rat kidney mitochondrial membrane
In DepthDetails ArticlePubMed