BDBM50253896 2-(2-(4-chlorophenyl)-1H-indol-3-yl)-N-methyl-2-oxo-N-pentylacetamide::CHEMBL516653
SMILES CCCCCN(C)C(=O)C(=O)c1c([nH]c2ccccc12)-c1ccc(Cl)cc1
InChI Key InChIKey=WCBAUBGDRHZDTL-UHFFFAOYSA-N
Data  1 KI
  Tab Delimited (TSV)   2D SDfile   Computed 3D by Vconf -m prep SDfile
Find this compound or compounds like it in BindingDB:
Activity Spreadsheet -- Enzyme Inhibition Constant Data from BindingDB
Found 1 hit for monomerid = 50253896
TargetTranslocator protein(Rattus norvegicus (rat))
Universit£
Curated by ChEMBL
LigandPNGBDBM50253896(2-(2-(4-chlorophenyl)-1H-indol-3-yl)-N-methyl-2-ox...)
Affinity DataKi:  3.40nM. Assay description: Displacement of [3H]PK11195 from translocator protein in rat kidney mitochondrial membrane
In DepthDetails ArticlePubMed