BDBM50254465 (+/-)-5-amino-N-(2-((N-ethyl-2-(methylsulfonyl)benzamido)methyl)-3,3,3-trifluoro-2-hydroxypropyl)-1-(4-fluorophenyl)-1H-pyrazole-4-carboxamide::5-amino-N-(2-((N-ethyl-2-(methylsulfonyl)benzamido)methyl)-3,3,3-trifluoro-2-hydroxypropyl)-1-(4-fluorophenyl)-1H-pyrazole-4-carboxamide::CHEMBL512127
SMILES CCN(CC(O)(CNC(=O)c1cnn(c1N)-c1ccc(F)cc1)C(F)(F)F)C(=O)c1ccccc1S(C)(=O)=O
InChI Key InChIKey=ONRDKYMCESZKKF-UHFFFAOYSA-N
Data  6 IC50  1 EC50
  Tab Delimited (TSV)   2D SDfile   Computed 3D by Vconf -m prep SDfile
Find this compound or compounds like it in BindingDB:
Activity Spreadsheet -- Enzyme Inhibition Constant Data from BindingDB
Found 7 hits for monomerid = 50254465
TargetCytochrome P450 1A2(Homo sapiens (Human))
Medicines Research Centre
Curated by ChEMBL
LigandPNGBDBM50254465((+/-)-5-amino-N-(2-((N-ethyl-2-(methylsulfonyl)ben...)
Affinity DataIC50: >4.00E+4nM. Assay description: Inhibition of CYP1A2 (unknown origin)
In DepthDetails ArticlePubMed
TargetCytochrome P450 2C19(Homo sapiens (Human))
Medicines Research Centre
Curated by ChEMBL
LigandPNGBDBM50254465((+/-)-5-amino-N-(2-((N-ethyl-2-(methylsulfonyl)ben...)
Affinity DataIC50:  8.70E+4nM. Assay description: Inhibition of CYP2C19 (unknown origin)
In DepthDetails ArticlePubMed
TargetCytochrome P450 2C9(Homo sapiens (Human))
Medicines Research Centre
Curated by ChEMBL
LigandPNGBDBM50254465((+/-)-5-amino-N-(2-((N-ethyl-2-(methylsulfonyl)ben...)
Affinity DataIC50:  2.30E+4nM. Assay description: Inhibition of CYP2C9 (unknown origin)
In DepthDetails ArticlePubMed
TargetGlucocorticoid receptor(Homo sapiens (Human))
Medicines Research Centre
Curated by ChEMBL
LigandPNGBDBM50254465((+/-)-5-amino-N-(2-((N-ethyl-2-(methylsulfonyl)ben...)
Affinity DataIC50:  63.1nM. Assay description: Displacement of fluorescent labelled Dexamethasone from glucocorticoid receptor
In DepthDetails ArticlePubMed
TargetCytochrome P450 3A4(Homo sapiens (Human))
Medicines Research Centre
Curated by ChEMBL
LigandPNGBDBM50254465((+/-)-5-amino-N-(2-((N-ethyl-2-(methylsulfonyl)ben...)
Affinity DataIC50:  3.00E+3nM. Assay description: Inhibition of CYP3A4 (unknown origin)
In DepthDetails ArticlePubMed
TargetGlucocorticoid receptor(Homo sapiens (Human))
Medicines Research Centre
Curated by ChEMBL
LigandPNGBDBM50254465((+/-)-5-amino-N-(2-((N-ethyl-2-(methylsulfonyl)ben...)
Affinity DataEC50:  158nM. Assay description: Agonist activity at human glucocorticoid receptor in human A549 cells assessed as transcriptional activity by MMTV luciferase reporter gene assay
In DepthDetails ArticlePubMed
TargetCytochrome P450 2D6(Homo sapiens (Human))
Medicines Research Centre
Curated by ChEMBL
LigandPNGBDBM50254465((+/-)-5-amino-N-(2-((N-ethyl-2-(methylsulfonyl)ben...)
Affinity DataIC50:  9.60E+4nM. Assay description: Inhibition of CYP2D6 (unknown origin)
In DepthDetails ArticlePubMed