BDBM50254536 1-(2-((S)-3-(aminomethyl)-1,2,3,4-tetrahydroisoquinoline-2-carbonyl)-4-(2-phenoxyacetamido)phenyl)-N,N-dibutyl-4-chloro-5-methyl-1H-pyrazole-3-carboxamide::CHEMBL508392
SMILES CCCCN(CCCC)C(=O)c1nn(c(C)c1Cl)-c1ccc(NC(=O)COc2ccccc2)cc1C(=O)N1Cc2ccccc2C[C@H]1CN
InChI Key InChIKey=ZVGFUPSZBYCCIH-PMERELPUSA-N
Data  2 IC50
  Tab Delimited (TSV)   2D SDfile   Computed 3D by Vconf -m prep SDfile
Find this compound or compounds like it in BindingDB:
Activity Spreadsheet -- Enzyme Inhibition Constant Data from BindingDB
Found 2 hits for monomerid = 50254536
TargetBcl2-associated agonist of cell death(Homo sapiens (Human))
Ucb Pharma
Curated by ChEMBL
LigandPNGBDBM50254536(1-(2-((S)-3-(aminomethyl)-1,2,3,4-tetrahydroisoqui...)
Affinity DataIC50:  808nM. Assay description: Inhibition of GST fused Bcl-xL (unknown origin) binding to biotinylated 26 mer Bak-BH3 peptide by HTRF-LANCE assay
In DepthDetails ArticlePubMed
TargetApoptosis regulator Bcl-2(Homo sapiens (Human))
Ucb Pharma
Curated by ChEMBL
LigandPNGBDBM50254536(1-(2-((S)-3-(aminomethyl)-1,2,3,4-tetrahydroisoqui...)
Affinity DataIC50:  30nM. Assay description: Inhibition of GST fused Bcl-2 (unknown origin) binding to biotinylated 26 mer Bak-BH3 peptide by HTRF-LANCE assay
In DepthDetails ArticlePubMed