BDBM50255063 (R)-3-((S)-2-(1H-benzo[d]imidazol-2-yl)pyrrolidine-1-carbonyl)heptanoic acid::CHEMBL506131
SMILES CCCC[C@H](CC(O)=O)C(=O)N1CCC[C@H]1c1nc2ccccc2[nH]1
InChI Key InChIKey=YZNULDWRNNKMJD-CJNGLKHVSA-N
Data  1 IC50
  Tab Delimited (TSV)   2D SDfile   Computed 3D by Vconf -m prep SDfile
Find this compound or compounds like it in BindingDB:
Activity Spreadsheet -- Enzyme Inhibition Constant Data from BindingDB
Found 1 hit for monomerid = 50255063
TargetPeptide deformylase(Mycobacterium tuberculosis)
Novartis Institute For Tropical Diseases
Curated by ChEMBL
LigandPNGBDBM50255063((R)-3-((S)-2-(1H-benzo[d]imidazol-2-yl)pyrrolidine...)
Affinity DataIC50:  202nM. Assay description: Inhibition of Mycobacterium tuberculosis peptide deformylase expressed in Escherichia coli M15(pREp4) by microplate assay
In DepthDetails ArticlePubMed