BDBM50255066 (S)-2-((S)-2-(benzo[d]oxazol-2-yl)pyrrolidine-1-carbonyl)-N-hydroxyhexanamide::CHEMBL517164
SMILES CCCC[C@H](C(=O)NO)C(=O)N1CCC[C@H]1c1nc2ccccc2o1
InChI Key InChIKey=BDPQRVOASIZZQP-OCCSQVGLSA-N
Data  1 IC50
  Tab Delimited (TSV)   2D SDfile   Computed 3D by Vconf -m prep SDfile
Find this compound or compounds like it in BindingDB:
Activity Spreadsheet -- Enzyme Inhibition Constant Data from BindingDB
Found 1 hit for monomerid = 50255066
TargetPeptide deformylase(Mycobacterium tuberculosis)
Novartis Institute For Tropical Diseases
Curated by ChEMBL
LigandPNGBDBM50255066((S)-2-((S)-2-(benzo[d]oxazol-2-yl)pyrrolidine-1-ca...)
Affinity DataIC50:  49nM. Assay description: Inhibition of Mycobacterium tuberculosis peptide deformylase expressed in Escherichia coli M15(pREp4) by microplate assay
In DepthDetails ArticlePubMed