BDBM50255245 3-chloro-1-(4-hydroxyphenyl)propan-1-one::CHEMBL500579
SMILES Oc1ccc(cc1)C(=O)CCCl
InChI Key InChIKey=QRXBKSZGQHXBDO-UHFFFAOYSA-N
Data  1 KI  1 IC50
  Tab Delimited (TSV)   2D SDfile   Computed 3D by Vconf -m prep SDfile
Find this compound or compounds like it in BindingDB:
Activity Spreadsheet -- Enzyme Inhibition Constant Data from BindingDB
Found 2 hits for monomerid = 50255245
Target4-aminobutyrate aminotransferase, mitochondrial(Rattus norvegicus)
Huazhong University Of Science And Technology
Curated by ChEMBL
LigandPNGBDBM50255245(3-chloro-1-(4-hydroxyphenyl)propan-1-one | CHEMBL5...)
Affinity DataKi:  2.43E+4nM. Assay description: Activity of GABA transaminase in rat brain
In DepthDetails ArticlePubMed
Target4-aminobutyrate aminotransferase, mitochondrial(Rattus norvegicus)
Huazhong University Of Science And Technology
Curated by ChEMBL
LigandPNGBDBM50255245(3-chloro-1-(4-hydroxyphenyl)propan-1-one | CHEMBL5...)
Affinity DataIC50:  3.99E+3nM. Assay description: Inhibition of GABA transaminase in rat brain by Kitz-Wilson plot
In DepthDetails ArticlePubMed