BDBM50256755 CHEMBL474989::methyl 4-(4-oxo-2-(1-phenylethyl)-1,2-dihydroquinazolin-3(4H)-yl)benzoate
SMILES COC(=O)c1ccc(cc1)N1C(Nc2ccccc2C1=O)C(C)c1ccccc1
InChI Key InChIKey=XXBZVNPPIUPMNT-UHFFFAOYSA-N
Data  1 EC50
  Tab Delimited (TSV)   2D SDfile   Computed 3D by Vconf -m prep SDfile
Find this compound or compounds like it in BindingDB:
Activity Spreadsheet -- Enzyme Inhibition Constant Data from BindingDB
Found 1 hit for monomerid = 50256755
TargetMetabotropic glutamate receptor 4(Homo sapiens (Human))
Vanderbilt University Medical Center
Curated by ChEMBL
LigandPNGBDBM50256755(CHEMBL474989 | methyl 4-(4-oxo-2-(1-phenylethyl)-1...)
Affinity DataEC50: >1.00E+4nM. Assay description: Activation of human mGluR4 expressed in CHO cells coexpressing Gqi5 protein assessed as potentiation of glutamate-induced response
In DepthDetails ArticlePubMed