BDBM50256788 CHEMBL4068637
SMILES Cc1ccc(NC(=O)c2ccc3C(=O)N(CCc4ccc(cc4)S(N)(=O)=O)C(=O)c3c2)c(c1)C(O)=O
InChI Key InChIKey=IVUBKJFQOXVRSQ-UHFFFAOYSA-N
Data  2 KI
  Tab Delimited (TSV)   2D SDfile   Computed 3D by Vconf -m prep SDfile
Find this compound or compounds like it in BindingDB:
Activity Spreadsheet -- Enzyme Inhibition Constant Data from BindingDB
Found 2 hits for monomerid = 50256788
TargetCarbonic anhydrase 2(Homo sapiens (Human))
Prince Sattam Bin Abdulaziz University
Curated by ChEMBL
LigandPNGBDBM50256788(CHEMBL4068637)
Affinity DataKi:  8.5nM. Assay description: Inhibition of recombinant human carbonic anhydrase 2 preincubated for 15 mins by stopped flow CO2 hydration assay
In DepthDetails ArticlePubMed
TargetCarbonic anhydrase 1(Homo sapiens (Human))
Prince Sattam Bin Abdulaziz University
Curated by ChEMBL
LigandPNGBDBM50256788(CHEMBL4068637)
Affinity DataKi:  25nM. Assay description: Inhibition of recombinant human carbonic anhydrase 1 preincubated for 15 mins by stopped flow CO2 hydration assay
In DepthDetails ArticlePubMed