BDBM50256872 7-nitro-N-phenethyl-1H-indole-2-carboxamide::CHEMBL475789
SMILES [O-][N+](=O)c1cccc2cc([nH]c12)C(=O)NCCc1ccccc1
InChI Key InChIKey=VXDJRTJBOJFUOC-UHFFFAOYSA-N
Data  1 IC50
  Tab Delimited (TSV)   2D SDfile   Computed 3D by Vconf -m prep SDfile
Find this compound or compounds like it in BindingDB:
Activity Spreadsheet -- Enzyme Inhibition Constant Data from BindingDB
Found 1 hit for monomerid = 50256872
Target1-phosphatidylinositol 4,5-bisphosphate phosphodiesterase gamma-2(Homo sapiens (Human))
The Institute Of Cancer Research
Curated by ChEMBL
LigandPNGBDBM50256872(7-nitro-N-phenethyl-1H-indole-2-carboxamide | CHEM...)
Affinity DataIC50:  1.00E+3nM. Assay description: Inhibition of recombinant phospholipase C gamma2 (unknown origin) expressed in baculovirus infected Sf9 cells using [3H]PIP2 by flashplate biochemica...
In DepthDetails ArticlePubMed