BDBM50256933 CHEMBL4083895
SMILES N[C@H]1C[C@@]1(F)c1cccc(F)c1
InChI Key InChIKey=YEXCSASHEQONSV-DTWKUNHWSA-N
Data  1 IC50
  Tab Delimited (TSV)   2D SDfile   Computed 3D by Vconf -m prep SDfile
Find this compound or compounds like it in BindingDB:
Activity Spreadsheet -- Enzyme Inhibition Constant Data from BindingDB
Found 1 hit for monomerid = 50256933
TargetLysine-specific histone demethylase 1A(Homo sapiens (Human))
University of East Anglia
Curated by ChEMBL
LigandPNGBDBM50256933(CHEMBL4083895)
Affinity DataIC50:  4.10E+3nM. Assay description: Inhibition of recombinant human His-tagged LSD1 expressed in Escherichia coli BL21 (DE3) using H3K4me2 peptide as substrate preincubated for 10 mins ...
In DepthDetails ArticlePubMed