BDBM50256978 CHEMBL4061133
SMILES N[C@H]1C[C@@]1(F)c1ccc(cc1)C(F)(F)F
InChI Key InChIKey=UHPFUDXNUSLKBE-DTWKUNHWSA-N
Data  1 IC50
  Tab Delimited (TSV)   2D SDfile   Computed 3D by Vconf -m prep SDfile
Find this compound or compounds like it in BindingDB:
Activity Spreadsheet -- Enzyme Inhibition Constant Data from BindingDB
Found 1 hit for monomerid = 50256978
TargetLysine-specific histone demethylase 1A(Homo sapiens (Human))
University of East Anglia
Curated by ChEMBL
LigandPNGBDBM50256978(CHEMBL4061133)
Affinity DataIC50: >2.50E+4nM. Assay description: Inhibition of recombinant human His-tagged LSD1 expressed in Escherichia coli BL21 (DE3) using H3K4me2 peptide as substrate preincubated for 10 mins ...
In DepthDetails ArticlePubMed