BDBM50256992 CHEMBL4090801
SMILES CCOc1ccc(cc1)[C@]1(F)C[C@@H]1N
InChI Key InChIKey=LVSDTAZRPVJCHU-WDEREUQCSA-N
Data  1 IC50
  Tab Delimited (TSV)   2D SDfile   Computed 3D by Vconf -m prep SDfile
Find this compound or compounds like it in BindingDB:
Activity Spreadsheet -- Enzyme Inhibition Constant Data from BindingDB
Found 1 hit for monomerid = 50256992
TargetLysine-specific histone demethylase 1A(Homo sapiens (Human))
University of East Anglia
Curated by ChEMBL
LigandPNGBDBM50256992(CHEMBL4090801)
Affinity DataIC50: >5.00E+4nM. Assay description: Inhibition of recombinant human His-tagged LSD1 expressed in Escherichia coli BL21 (DE3) using H3K4me2 peptide as substrate preincubated for 10 mins ...
In DepthDetails ArticlePubMed