BDBM50258244 CHEMBL4100583
SMILES [H][C@@]12CC[C@H](C(=O)Cn3cc(cn3)C#N)[C@@]1(C)CC[C@@]1([H])[C@@]2([H])CC[C@]2([H])C[C@@](O)(CC)CC[C@]12[H]
InChI Key InChIKey=VCXHZQXVKCMJJU-HXKXIXNFSA-N
Data  1 EC50
  Tab Delimited (TSV)   2D SDfile   Computed 3D by Vconf -m prep SDfile
Find this compound or compounds like it in BindingDB:
Activity Spreadsheet -- Enzyme Inhibition Constant Data from BindingDB
Found 1 hit for monomerid = 50258244
TargetGamma-aminobutyric acid receptor subunit alpha-1/beta-2/gamma-2(Homo sapiens (Human))
Sage Therapeutics
Curated by ChEMBL
LigandPNGBDBM50258244(CHEMBL4100583)
Affinity DataEC50: >3.00E+3nM. Assay description: Positive allosteric modulation of GABAA receptor alpha4beta3delta (unknown origin) expressed in CHO cells assessed as potentiation of GABA-mediated i...
In DepthDetails ArticlePubMed