BDBM50259388 2-(4-Chlorophenyl)-4(5)-phenylimidazole::CHEMBL503978
SMILES Clc1ccc(cc1)-c1nc(c[nH]1)-c1ccccc1
InChI Key InChIKey=RYAFXUYSBDAZBC-UHFFFAOYSA-N
Data  1 IC50
  Tab Delimited (TSV)   2D SDfile   Computed 3D by Vconf -m prep SDfile
Find this compound or compounds like it in BindingDB:
Activity Spreadsheet -- Enzyme Inhibition Constant Data from BindingDB
Found 1 hit for monomerid = 50259388
TargetSodium channel protein type 2 subunit alpha(Homo sapiens (Human))
Università
Curated by ChEMBL
LigandPNGBDBM50259388(2-(4-Chlorophenyl)-4(5)-phenylimidazole | CHEMBL50...)
Affinity DataIC50:  1.40E+3nM. Assay description: Inhibition of human Nav1.2 channel expressed in HEK cells by patch-clamp electrophysiology method
In DepthDetails ArticlePubMed