BDBM50259476 CHEMBL4084364
SMILES CC[C@@H](CO)Nc1ccc2ncc(-c3ccnc(N)n3)n2n1
InChI Key InChIKey=FJAIARRQBXWUMX-VIFPVBQESA-N
Data  11 IC50
  Tab Delimited (TSV)   2D SDfile   Computed 3D by Vconf -m prep SDfile
Find this compound or compounds like it in BindingDB:
Activity Spreadsheet -- Enzyme Inhibition Constant Data from BindingDB
Found 11 hits for monomerid = 50259476
TargetDual specificity tyrosine-phosphorylation-regulated kinase 3(Homo sapiens (Human))
University of Paris
Curated by ChEMBL
LigandPNGBDBM50259476(CHEMBL4084364)
Affinity DataIC50:  320nM. Assay description: Inhibition of GST tagged recombinant human DYRK3 expressed in Escherichia coli using woodtide as substrate after 30 mins by [gamma-33P]ATP based scin...
Ligand InfoPC cidPC sid
In DepthDetails ArticlePubMed
TargetDual specificity protein kinase CLK2(Mus musculus)
University of Paris
Curated by ChEMBL
LigandPNGBDBM50259476(CHEMBL4084364)
Affinity DataIC50:  1.10E+3nM. Assay description: Inhibition of GST tagged recombinant mouse CLK2 expressed in Escherichia coli using RS peptide as substrate after 30 mins by [gamma-33P]ATP based sci...
Ligand InfoPC cidPC sid
In DepthDetails ArticlePubMed
TargetDual specificity tyrosine-phosphorylation-regulated kinase 1A(Homo sapiens (Human))
University of Paris
Curated by ChEMBL
LigandPNGBDBM50259476(CHEMBL4084364)
Affinity DataIC50:  3.20E+3nM. Assay description: Inhibition of GST tagged recombinant human DYRK1A expressed in Escherichia coli using woodtide as substrate after 30 mins by [gamma-33P]ATP based sci...
Ligand InfoPC cidPC sid
In DepthDetails ArticlePubMed
TargetDual specificity protein kinase CLK4(Mus musculus)
University of Paris
Curated by ChEMBL
LigandPNGBDBM50259476(CHEMBL4084364)
Affinity DataIC50:  130nM. Assay description: Inhibition of GST tagged recombinant mouse CLK4 expressed in Escherichia coli using RS peptide as substrate after 30 mins by [gamma-33P]ATP based sci...
Ligand InfoPC cidPC sid
In DepthDetails ArticlePubMed
TargetDual specificity protein kinase CLK1(Mus musculus)
University of Paris
Curated by ChEMBL
LigandPNGBDBM50259476(CHEMBL4084364)
Affinity DataIC50:  250nM. Assay description: Inhibition of GST tagged recombinant mouse CLK1 expressed in Escherichia coli using RS peptide as substrate after 30 mins by [gamma-33P]ATP based sci...
Ligand InfoPC cidPC sid
In DepthDetails ArticlePubMed
TargetCyclin-T1/Cyclin-dependent kinase 9(Homo sapiens (Human))
University of Paris
Curated by ChEMBL
LigandPNGBDBM50259476(CHEMBL4084364)
Affinity DataIC50:  2.20E+3nM. Assay description: Inhibition of human recombinant CDK5/p25 after 30 mins by [gamma-33P]ATP based scintillation counting analysis
Ligand InfoPC cidPC sid
In DepthDetails ArticlePubMed
TargetDual specificity tyrosine-phosphorylation-regulated kinase 2(Homo sapiens (Human))
University of Paris
Curated by ChEMBL
LigandPNGBDBM50259476(CHEMBL4084364)
Affinity DataIC50:  400nM. Assay description: Inhibition of GST tagged recombinant human DYRK2 expressed in Escherichia coli using using woodtide as substrate after 30 mins by [gamma-33P]ATP base...
Ligand InfoPC cidPC sid
In DepthDetails ArticlePubMed
TargetDual specificity protein kinase CLK3(Mus musculus)
University of Paris
Curated by ChEMBL
LigandPNGBDBM50259476(CHEMBL4084364)
Affinity DataIC50:  7.80E+3nM. Assay description: Inhibition of GST tagged recombinant mouse CLK3 expressed in Escherichia coli using RS peptide as substrate after 30 mins by [gamma-33P]ATP based sci...
Ligand InfoPC cidPC sid
In DepthDetails ArticlePubMed
TargetCyclin-A2/Cyclin-dependent kinase 2(Homo sapiens (Human))
University of Paris
Curated by ChEMBL
LigandPNGBDBM50259476(CHEMBL4084364)
Affinity DataIC50:  5.10E+3nM. Assay description: Inhibition of human recombinant CDK5/p25 after 30 mins by [gamma-33P]ATP based scintillation counting analysis
Ligand InfoPC cidPC sid
In DepthDetails ArticlePubMed
TargetCyclin-dependent kinase 5 activator 1(Homo sapiens (Human))
University of Paris
Curated by ChEMBL
LigandPNGBDBM50259476(CHEMBL4084364)
Affinity DataIC50:  5.10E+3nM. Assay description: Inhibition of human recombinant CDK5/p25 after 30 mins by [gamma-33P]ATP based scintillation counting analysis
Ligand InfoPC cidPC sid
In DepthDetails ArticlePubMed
TargetDual specificity tyrosine-phosphorylation-regulated kinase 1B(Homo sapiens (Human))
University of Paris
Curated by ChEMBL
LigandPNGBDBM50259476(CHEMBL4084364)
Affinity DataIC50:  2.20E+3nM. Assay description: Inhibition of GST tagged recombinant human DYRK1B expressed in Escherichia coli using woodtide as substrate after 30 mins by [gamma-33P]ATP based sci...
Ligand InfoPC cidPC sid
In DepthDetails ArticlePubMed