BDBM50259630 CHEMBL4079843
SMILES Cc1c(Cl)c(=O)oc2cc(OCc3ccc(Br)cc3)ccc12
InChI Key InChIKey=CFDZXXWQQBIBLA-UHFFFAOYSA-N
Data  4 IC50
  Tab Delimited (TSV)   2D SDfile   Computed 3D by Vconf -m prep SDfile
Find this compound or compounds like it in BindingDB:
Activity Spreadsheet -- Enzyme Inhibition Constant Data from BindingDB
Found 4 hits for monomerid = 50259630
TargetAmine oxidase [flavin-containing] B(Homo sapiens (Human))
University of The Western Cape
Curated by ChEMBL
LigandPNGBDBM50259630(CHEMBL4079843)
Affinity DataIC50:  0.800nM. Assay description: Inhibition of recombinant human MAO-B assessed as reduction in 4-hydroxyquinolone production using kynuramine as substrate after 20 mins by fluoresce...
In DepthDetails ArticlePubMed
TargetAcetylcholinesterase(Electrophorus electricus (Electric eel))
University of The Western Cape
Curated by ChEMBL
LigandPNGBDBM50259630(CHEMBL4079843)
Affinity DataIC50: >1.00E+5nM. Assay description: Inhibition of electric eel AChE using acetylthiocholine iodide as substrate preincubated for 10 mins followed by substrate addition measured after 10...
In DepthDetails ArticlePubMed
TargetCholinesterase(Equus caballus (Horse))
University of The Western Cape
Curated by ChEMBL
LigandPNGBDBM50259630(CHEMBL4079843)
Affinity DataIC50: >1.00E+5nM. Assay description: Inhibition of equine serum BuChE using S-butylthiocholine iodide as substrate preincubated for 10 mins followed by substrate addition measured after ...
In DepthDetails ArticlePubMed
TargetAmine oxidase [flavin-containing] A(Homo sapiens (Human))
University of The Western Cape
Curated by ChEMBL
LigandPNGBDBM50259630(CHEMBL4079843)
Affinity DataIC50:  370nM. Assay description: Inhibition of recombinant human MAO-A assessed as reduction in 4-hydroxyquinolone production using kynuramine as substrate after 20 mins by fluoresce...
In DepthDetails ArticlePubMed