BDBM50260065 CHEMBL4088597::US9957263, Example 63
SMILES CCS(=O)(=O)c1ccc(OCC2CC2(F)F)c(c1)-c1cn(C)c(=O)c2[nH]c(cc12)C#CCN(C)C
InChI Key InChIKey=GYXDBZSTIOVMLS-UHFFFAOYSA-N
Data  4 KI
  Tab Delimited (TSV)   2D SDfile   Computed 3D by Vconf -m prep SDfile
Find this compound or compounds like it in BindingDB:
Activity Spreadsheet -- Enzyme Inhibition Constant Data from BindingDB
Found 4 hits for monomerid = 50260065
TargetBromodomain-containing protein 4(Homo sapiens (Human))
University of Texas Medical Branch
Curated by ChEMBL
LigandPNGBDBM50260065(CHEMBL4088597 | US9957263, Example 63)
Affinity DataKi:  1.30nM. Assay description: Inhibition of His-tagged BRD4 bromodomain 1 (K57 to E168 residues) (unknown origin) after 1 hr by TR-FRET assay
In DepthDetails ArticlePubMed
TargetBromodomain-containing protein 4(Homo sapiens (Human))
University of Texas Medical Branch
Curated by ChEMBL
LigandPNGBDBM50260065(CHEMBL4088597 | US9957263, Example 63)
Affinity DataKi:  1.30nM. Assay description: Inhibition of His-epitope tagged BRD4 bromodomain 1 (44 to 168 residues) (unknown origin) using biotinylated histone H4 as substrate after 1 hr by Al...
In DepthDetails ArticlePubMed
TargetBromodomain-containing protein 4(Homo sapiens (Human))
University of Texas Medical Branch
Curated by ChEMBL
LigandPNGBDBM50260065(CHEMBL4088597 | US9957263, Example 63)
Affinity DataKi:  1.30nM. Assay description: Compound dilution series were prepared in DMSO via a 3-fold serial dilution from 2.5 mM to 42 nM. Compounds were then diluted 6:100 in assay buffer (...
In DepthDetails US Patent
TargetBromodomain-containing protein 4(Homo sapiens (Human))
University of Texas Medical Branch
Curated by ChEMBL
LigandPNGBDBM50260065(CHEMBL4088597 | US9957263, Example 63)
Affinity DataKi:  3.30nM. Assay description: Compound dilution series were prepared in DMSO via a 3-fold serial dilution from 2.5 mM to 42 nM. Compounds were then diluted 6:100 in assay buffer (...
In DepthDetails US Patent