BDBM50260515 (E)-1-dodecyl-3-(hydroxyimino)indolin-2-one::CHEMBL494565
SMILES CCCCCCCCCCCCN1C(=O)C(N=O)c2ccccc12
InChI Key InChIKey=KGYVKVKETIYJQI-UHFFFAOYSA-N
Data  1 IC50
  Tab Delimited (TSV)   2D SDfile   Computed 3D by Vconf -m prep SDfile
Find this compound or compounds like it in BindingDB:
Activity Spreadsheet -- Enzyme Inhibition Constant Data from BindingDB
Found 1 hit for monomerid = 50260515
TargetM-phase inducer phosphatase 1(Homo sapiens (Human))
Doshisha Women'S College Of Liberal Arts
Curated by ChEMBL
LigandPNGBDBM50260515((E)-1-dodecyl-3-(hydroxyimino)indolin-2-one | CHEM...)
Affinity DataIC50:  3.30E+4nM. Assay description: Inhibition of human Cdc25A phosphatase activity
In DepthDetails ArticlePubMed