BDBM50260729 1,4-dihydropyrrolo[3,2-c]pyrazole-5-carboxylic acid::CHEMBL453214
SMILES OC(=O)c1cc2n[nH]cc2[nH]1
InChI Key InChIKey=JESHBAKAUQDDRC-UHFFFAOYSA-N
Data  1 IC50
  Tab Delimited (TSV)   2D SDfile   Computed 3D by Vconf -m prep SDfile
Find this compound or compounds like it in BindingDB:
Activity Spreadsheet -- Enzyme Inhibition Constant Data from BindingDB
Found 1 hit for monomerid = 50260729
TargetD-amino-acid oxidase(Homo sapiens (Human))
Merck Sharp & Dohme
Curated by ChEMBL
LigandPNGBDBM50260729(1,4-dihydropyrrolo[3,2-c]pyrazole-5-carboxylic aci...)
Affinity DataIC50: >5.00E+3nM. Assay description: Inhibition of human DAO
In DepthDetails ArticlePubMed