BDBM50260730 3-chloro-4H-furo[3,2-b]pyrrole-5-carboxylic acid::CHEMBL454969
SMILES OC(=O)c1cc2occ(Cl)c2[nH]1
InChI Key InChIKey=HDPBBBQTCSOYSB-UHFFFAOYSA-N
Data  1 IC50
  Tab Delimited (TSV)   2D SDfile   Computed 3D by Vconf -m prep SDfile
Find this compound or compounds like it in BindingDB:
Activity Spreadsheet -- Enzyme Inhibition Constant Data from BindingDB
Found 1 hit for monomerid = 50260730
TargetD-amino-acid oxidase(Homo sapiens (Human))
Merck Sharp & Dohme
Curated by ChEMBL
LigandPNGBDBM50260730(3-chloro-4H-furo[3,2-b]pyrrole-5-carboxylic acid |...)
Affinity DataIC50:  1.43E+3nM. Assay description: Inhibition of human DAO
In DepthDetails ArticlePubMed