BDBM50261014 (E)-2-(2-oxo-1-(3-phenylpropyl)indolin-3-ylidene)acetic acid::CHEMBL444927
SMILES OC(=O)\C=C1\C(=O)N(CCCc2ccccc2)c2ccccc12
InChI Key InChIKey=MCRARTPPXSFLNE-DTQAZKPQSA-N
Data  1 IC50
  Tab Delimited (TSV)   2D SDfile   Computed 3D by Vconf -m prep SDfile
Find this compound or compounds like it in BindingDB:
Activity Spreadsheet -- Enzyme Inhibition Constant Data from BindingDB
Found 1 hit for monomerid = 50261014
TargetM-phase inducer phosphatase 1(Homo sapiens (Human))
Doshisha Women'S College Of Liberal Arts
Curated by ChEMBL
LigandPNGBDBM50261014((E)-2-(2-oxo-1-(3-phenylpropyl)indolin-3-ylidene)a...)
Affinity DataIC50: >1.00E+5nM. Assay description: Inhibition of human Cdc25A phosphatase activity
In DepthDetails ArticlePubMed