BDBM50261057 (Z)-2-(1-decyl-2-oxoindolin-3-ylidene)acetic acid::CHEMBL493798
SMILES CCCCCCCCCCN1C(=O)\C(=C/C(O)=O)c2ccccc12
InChI Key InChIKey=LIUQXAWYSKFADK-ICFOKQHNSA-N
Data  1 IC50
  Tab Delimited (TSV)   2D SDfile   Computed 3D by Vconf -m prep SDfile
Find this compound or compounds like it in BindingDB:
Activity Spreadsheet -- Enzyme Inhibition Constant Data from BindingDB
Found 1 hit for monomerid = 50261057
TargetM-phase inducer phosphatase 1(Homo sapiens (Human))
Doshisha Women'S College Of Liberal Arts
Curated by ChEMBL
LigandPNGBDBM50261057((Z)-2-(1-decyl-2-oxoindolin-3-ylidene)acetic acid ...)
Affinity DataIC50:  1.20E+4nM. Assay description: Inhibition of human Cdc25A phosphatase activity
In DepthDetails ArticlePubMed