BDBM50261190 1-{2-[(1S)-Amino-2-methylpropyl]-6-fluorophenyl}-4-[(2R)-methyl-3-(4-chlorophenyl)propionyl]-piperazine::CHEMBL494818
SMILES CC(C)[C@H](N)c1cccc(F)c1N1CCN(CC1)C(=O)[C@H](C)Cc1ccc(Cl)cc1
InChI Key InChIKey=BBCHXERJCYULCI-VGSWGCGISA-N
Data  1 KI
  Tab Delimited (TSV)   2D SDfile   Computed 3D by Vconf -m prep SDfile
Find this compound or compounds like it in BindingDB:
Activity Spreadsheet -- Enzyme Inhibition Constant Data from BindingDB
Found 1 hit for monomerid = 50261190
TargetMelanocortin receptor 4(Homo sapiens (Human))
Neurocrine Biosciences
Curated by ChEMBL
LigandPNGBDBM50261190(1-{2-[(1S)-Amino-2-methylpropyl]-6-fluorophenyl}-4...)
Affinity DataKi:  83nM. Assay description: Displacement of [125I]NDP-MSH from human MC4R expressed in HEK293 cells
In DepthDetails ArticlePubMed