BDBM50261681 (3R,6R,9S,12R,15S)-12-benzyl-9-(3-carbamimidamidopropyl)-15-(1H-imidazol-5-ylmethyl)-6-(naphthalen-2-ylmethyl)-19-nitro-5,8,11,14,17-pentaoxo-2,3,4,5,6,7,8,9,10,11,12,13,14,15,16,17-hexadecahydro-1,4,7,10,13,16-benzothiapentazacyclononadecine-3-carboxamide::CHEMBL505536
SMILES NC([NH-])=[NH+]CCC[C@@H]1NC(=O)[C@@H](Cc2ccccc2)NC(=O)[C@H](Cc2cnc[nH]2)NC(=O)c2cc(ccc2SC[C@H](NC(=O)[C@@H](Cc2ccc3ccccc3c2)NC1=O)C(N)=O)[N+]([O-])=O
InChI Key InChIKey=XOJTYHDBHOXJDL-BEYBIPRGSA-N
Data  1 IC50  1 EC50
  Tab Delimited (TSV)   2D SDfile   Computed 3D by Vconf -m prep SDfile
Find this compound or compounds like it in BindingDB:
Activity Spreadsheet -- Enzyme Inhibition Constant Data from BindingDB
Found 2 hits for monomerid = 50261681
TargetMelanocortin receptor 3(Homo sapiens (Human))
University Of Arizona
Curated by ChEMBL
LigandPNGBDBM50261681((3R,6R,9S,12R,15S)-12-benzyl-9-(3-carbamimidamidop...)
Affinity DataEC50:  330nM. Assay description: Agonist activity at human melanocortin 3 receptor expressed in HEK293 cells assessed as cAMP accumulation
In DepthDetails ArticlePubMed
TargetMelanocortin receptor 3(Homo sapiens (Human))
University Of Arizona
Curated by ChEMBL
LigandPNGBDBM50261681((3R,6R,9S,12R,15S)-12-benzyl-9-(3-carbamimidamidop...)
Affinity DataIC50: >8.00E+3nM. Assay description: Displacement of [125I]-[Nle4, D-Phe7]alpha-MSH from human melanocortin 3 receptor expressed in HEK293 cells
In DepthDetails ArticlePubMed