BDBM50262058 (1H-indol-3-yl)(2-(quinolin-6-ylmethylamino)phenyl)methanone::CHEMBL469043
SMILES O=C(c1c[nH]c2ccccc12)c1ccccc1NCc1ccc2ncccc2c1
InChI Key InChIKey=PQZBCRDHJWKWNY-UHFFFAOYSA-N
Data  2 IC50
  Tab Delimited (TSV)   2D SDfile   Computed 3D by Vconf -m prep SDfile
Find this compound or compounds like it in BindingDB:
Activity Spreadsheet -- Enzyme Inhibition Constant Data from BindingDB
Found 2 hits for monomerid = 50262058
TargetVascular endothelial growth factor receptor 2(Homo sapiens (Human))
Imclone Systems
Curated by ChEMBL
LigandPNGBDBM50262058((1H-indol-3-yl)(2-(quinolin-6-ylmethylamino)phenyl...)
Affinity DataIC50:  1.00E+3nM. Assay description: Inhibition of KDR (unknown origin) autophosphorylation by cell based assay
In DepthDetails ArticlePubMed
TargetVascular endothelial growth factor receptor 2(Homo sapiens (Human))
Imclone Systems
Curated by ChEMBL
LigandPNGBDBM50262058((1H-indol-3-yl)(2-(quinolin-6-ylmethylamino)phenyl...)
Affinity DataIC50:  2.00E+3nM. Assay description: Inhibition of KDR (unknown origin) by HTRF assay
In DepthDetails ArticlePubMed