BDBM50262096 6-(((11-hydroxy-4-(methoxymethyl)-4a,6a-dimethyl-5-(5-(methyl(7-nitrobenzo[c][1,2,5]oxadiazol-4-yl)amino)pentanoyloxy)-2,7,10-trioxo-4,4a,6,6a,7,8,9,9a-octahydroindeno[4,5-h]isochromen-1(2H,5H,10H)-ylidene)methyl)(methyl)amino)hexanoic acid::CHEMBL449623
SMILES COCC1OC(=O)C([CH-]N(C)CCCCCC(O)=O)=C2C(=[OH+])C(=O)C3=C(C(CC4(C)C3CCC4=O)OC(=O)CCCCN(C)c3ccc([N+]([O-])=O)c4nonc34)C12C
InChI Key InChIKey=XYQYSGOQOBDQER-UHFFFAOYSA-O
Data  1 IC50
  Tab Delimited (TSV)   2D SDfile   Computed 3D by Vconf -m prep SDfile
Find this compound or compounds like it in BindingDB:
Activity Spreadsheet -- Enzyme Inhibition Constant Data from BindingDB
Found 1 hit for monomerid = 50262096
TargetPhosphatidylinositol 4,5-bisphosphate 3-kinase catalytic subunit alpha isoform(Homo sapiens (Human))
Harvard Medical School
Curated by ChEMBL
LigandPNGBDBM50262096(6-(((11-hydroxy-4-(methoxymethyl)-4a,6a-dimethyl-5...)
Affinity DataIC50:  174nM. Assay description: Inhibition of PI3K (unknown origin) by fluorescence energy transfer assay
In DepthDetails ArticlePubMed