BDBM50263564 1-(3-methoxyphenylsulfonyl)-1,5,6,7,8,9-hexahydroazepino[4,5-f]indole::CHEMBL477386
SMILES COc1cccc(c1)S(=O)(=O)n1ccc2cc3CCNCCc3cc12
InChI Key InChIKey=XPTXBBCZWWFNRD-UHFFFAOYSA-N
Data  2 IC50
  Tab Delimited (TSV)   2D SDfile   Computed 3D by Vconf -m prep SDfile
Find this compound or compounds like it in BindingDB:
Activity Spreadsheet -- Enzyme Inhibition Constant Data from BindingDB
Found 2 hits for monomerid = 50263564
TargetCytochrome P450 3A4(Homo sapiens (Human))
Glaxosmithkline
Curated by ChEMBL
LigandPNGBDBM50263564(1-(3-methoxyphenylsulfonyl)-1,5,6,7,8,9-hexahydroa...)
Affinity DataIC50:  1.70E+4nM. Assay description: Inhibition of human CYP3A4 by microtiter plate assays using N-N,diethyl-formamide as substrate
In DepthDetails ArticlePubMed
TargetCytochrome P450 3A4(Homo sapiens (Human))
Glaxosmithkline
Curated by ChEMBL
LigandPNGBDBM50263564(1-(3-methoxyphenylsulfonyl)-1,5,6,7,8,9-hexahydroa...)
Affinity DataIC50:  2.70E+4nM. Assay description: Inhibition of human CYP3A4 by microtiter plate assays using PPR substrate
In DepthDetails ArticlePubMed