BDBM50265185 CHEMBL4092088
SMILES CC(C)C[C@H](NC(C)=O)C(=O)N[C@@H](CC(C)C)C(=O)N1CCC[C@H]1C(=O)N[C@@H](CC(C)C)C(=O)N[C@@H](CCCNC(N)=N)C(=O)N[C@@H](C(C)C)C(=O)N[C@@H](CCCCN)C(=O)NCc1ccc(cc1)C(N)=N
InChI Key InChIKey=TWAATHLIBXIZMY-IFLLZMBLSA-N
Data  2 KI
  Tab Delimited (TSV)   2D SDfile   Computed 3D by Vconf -m prep SDfile
Find this compound or compounds like it in BindingDB:
Activity Spreadsheet -- Enzyme Inhibition Constant Data from BindingDB
Found 2 hits for monomerid = 50265185
TargetFurin(Homo sapiens (Human))
University Of Gdansk
Curated by ChEMBL
LigandPNGBDBM50265185(CHEMBL4092088)
Affinity DataKi:  1.40nM. Assay description: Inhibition of recombinant human furin expressed in drosophila S2 cells using pyrGlu-Arg-Thr-Lys-Arg-7-amido-4-methylcoumarin as substrate after 60 mi...
In DepthDetails ArticlePubMed
TargetProprotein convertase subtilisin/kexin type 6(Homo sapiens (Human))
University Of Gdansk
Curated by ChEMBL
LigandPNGBDBM50265185(CHEMBL4092088)
Affinity DataKi:  4nM. Assay description: Inhibition of recombinant human PACE4 expressed in drosophila S2 cells using pyrGlu-Arg-Thr-Lys-Arg-7-amido-4-methylcoumarin as substrate after 60 mi...
In DepthDetails ArticlePubMed