BDBM502656 US11028090, Example 622::US11028090, Example 623::[4-(7- methoxy-1- ethyl- [1,2,4]tria- zolo[4,3- a]quinoxaline- 4- ylamino)- butyl]-3- methyl- butyramide
SMILES CCc1nnc2c(NCCCCNC(=O)OC(C)C)nc3cc(OC)ccc3n12
InChI Key InChIKey=YWAWLGGUVIHKPN-UHFFFAOYSA-N
Data  2 IC50
  Tab Delimited (TSV)   2D SDfile   Computed 3D by Vconf -m prep SDfile
Find this compound or compounds like it in BindingDB:
Activity Spreadsheet -- Enzyme Inhibition Constant Data from BindingDB
Found 2 hits for monomerid = 502656
TargetBromodomain-containing protein 4(Homo sapiens (Human))
Dong Wha Pharm.
US Patent
LigandPNGBDBM502656(US11028090, Example 622 | US11028090, Example 623 ...)
Affinity DataIC50:  5nM. Assay description: The following experiment was performed to evaluate the ability of [1,2,4]triazolo[4,3-a]quinoxaline derivative of the present invention to inhibit th...
Ligand InfoPC cidPC sid
In DepthDetails US Patent
TargetBromodomain-containing protein 4(Homo sapiens (Human))
Dong Wha Pharm.
US Patent
LigandPNGBDBM502656(US11028090, Example 622 | US11028090, Example 623 ...)
Affinity DataIC50:  20nM. Assay description: The following experiment was performed to evaluate the ability of [1,2,4]triazolo[4,3-a]quinoxaline derivative of the present invention to inhibit th...
Ligand InfoPC cidPC sid
In DepthDetails US Patent