BDBM50266553 2-(1-benzyl-1H-inden-3-yl)-N,N-dimethylethanamine::CHEMBL457351
SMILES CN(C)CCC1=CC(Cc2ccccc2)c2ccccc12
InChI Key InChIKey=CKYIFJXFLBXUQQ-UHFFFAOYSA-N
Data  1 KI
  Tab Delimited (TSV)   2D SDfile   Computed 3D by Vconf -m prep SDfile
Find this compound or compounds like it in BindingDB:
Activity Spreadsheet -- Enzyme Inhibition Constant Data from BindingDB
Found 1 hit for monomerid = 50266553
Target5-hydroxytryptamine receptor 6(Homo sapiens (Human))
Universitat De Barcelona
Curated by ChEMBL
LigandPNGBDBM50266553(2-(1-benzyl-1H-inden-3-yl)-N,N-dimethylethanamine ...)
Affinity DataKi:  3nM. Assay description: Displacement of [3H]LSD from human 5HT6 receptor expressed in HEK293 cells by liquid scintillation counting
In DepthDetails ArticlePubMed