BDBM50266617 6-Chloro-N-[2-methyl-3-(2-pyrrolidin-1-ylethyl)-1H-inden-5-yl]imidazo[2,1-b][1,3]thiazole-5-sulfonamide::CHEMBL478894
SMILES CC1=C(CCN2CCCC2)c2cc(NS(=O)(=O)c3c(Cl)nc4sccn34)ccc2C1
InChI Key InChIKey=GNXOBMAGBOWJSB-UHFFFAOYSA-N
Data  1 KI
  Tab Delimited (TSV)   2D SDfile   Computed 3D by Vconf -m prep SDfile
Find this compound or compounds like it in BindingDB:
Activity Spreadsheet -- Enzyme Inhibition Constant Data from BindingDB
Found 1 hit for monomerid = 50266617
Target5-hydroxytryptamine receptor 6(Homo sapiens (Human))
Universitat De Barcelona
Curated by ChEMBL
LigandPNGBDBM50266617(6-Chloro-N-[2-methyl-3-(2-pyrrolidin-1-ylethyl)-1H...)
Affinity DataKi:  17nM. Assay description: Displacement of [3H]LSD from human 5HT6 receptor expressed in HEK293 cells by liquid scintillation counting
In DepthDetails ArticlePubMed