BDBM50266734 CHEMBL4096081
SMILES NC(=N)NCCC[C@H](NC(=O)[C@@H](Cc1ccc(I)cc1)NC(=O)[C@@H]1Cc2ccccc2CN1)C(=O)N[C@@H](Cc1c[nH]c2ccccc12)C(N)=O
InChI Key InChIKey=ZRDWRVYWGBIWDI-XHPANXIASA-N
Data  1 KI
  Tab Delimited (TSV)   2D SDfile   Computed 3D by Vconf -m prep SDfile
Find this compound or compounds like it in BindingDB:
Activity Spreadsheet -- Enzyme Inhibition Constant Data from BindingDB
Found 1 hit for monomerid = 50266734
TargetMelanocortin receptor 4(Homo sapiens (Human))
University Of Minnesota
Curated by ChEMBL
LigandPNGBDBM50266734(CHEMBL4096081)
Affinity DataKi:  0.790nM. Assay description: Antagonist activity at human MC4R expressed in CHO cells assessed as inhibition of aplha MSH-induced cAMP activation after 45 mins
In DepthDetails ArticlePubMed