BDBM50266889 CHEMBL513922::N-benzyl-N-ethyl-2-(7-methyl-8-oxo-2-phenyl-7H-purin-9(8H)-yl)acetamide
SMILES CCN(Cc1ccccc1)C(=O)Cn1c2nc(ncc2n(C)c1=O)-c1ccccc1
InChI Key InChIKey=NBMBIEOUVBHEBM-UHFFFAOYSA-N
Data  2 KI
  Tab Delimited (TSV)   2D SDfile   Computed 3D by Vconf -m prep SDfile
Find this compound or compounds like it in BindingDB:
Activity Spreadsheet -- Enzyme Inhibition Constant Data from BindingDB
Found 2 hits for monomerid = 50266889
TargetTranslocator protein(Rattus norvegicus (rat))
National Institute Of Radiological Sciences
Curated by ChEMBL
LigandPNGBDBM50266889(CHEMBL513922 | N-benzyl-N-ethyl-2-(7-methyl-8-oxo-...)
Affinity DataKi:  0.200nM. Assay description: Displacement of [11C]PK11195 from PBR receptor in rat brain membrane
In DepthDetails ArticlePubMed
TargetTranslocator protein(Rattus norvegicus (rat))
National Institute Of Radiological Sciences
Curated by ChEMBL
LigandPNGBDBM50266889(CHEMBL513922 | N-benzyl-N-ethyl-2-(7-methyl-8-oxo-...)
Affinity DataKi:  0.600nM. Assay description: Displacement of [11C]-PK-11195 from TPSO in Sprague-Dawley rat brain homogenate after 30 mins by gamma counting
In DepthDetails ArticlePubMed