BDBM50267171 2-(2-hydroxyethylamino)-3-methylnaphthalene-1,4-dione::CHEMBL505950
SMILES Cc1c(O)c2ccccc2c(O)c1NCC=O
InChI Key InChIKey=BIEGPSSMXDOFPB-UHFFFAOYSA-N
Data  3 IC50
  Tab Delimited (TSV)   2D SDfile   Computed 3D by Vconf -m prep SDfile
Find this compound or compounds like it in BindingDB:
Activity Spreadsheet -- Enzyme Inhibition Constant Data from BindingDB
Found 3 hits for monomerid = 50267171
TargetM-phase inducer phosphatase 2(Homo sapiens (Human))
Virginia Polytechnic Institute And State University
Curated by ChEMBL
LigandPNGBDBM50267171(2-(2-hydroxyethylamino)-3-methylnaphthalene-1,4-di...)
Affinity DataIC50: >5.00E+4nM. Assay description: Inhibition of histidine-tagged human recombinant Cdc25B catalytic domain expressed in Escherichia coli
In DepthDetails ArticlePubMed
TargetDual specificity protein phosphatase 6(Rattus norvegicus)
Virginia Polytechnic Institute And State University
Curated by ChEMBL
LigandPNGBDBM50267171(2-(2-hydroxyethylamino)-3-methylnaphthalene-1,4-di...)
Affinity DataIC50: >5.00E+4nM. Assay description: Inhibition of histidine-tagged rat recombinant MKP3 catalytic domain expressed in Escherichia coli BL21(DE3)
In DepthDetails ArticlePubMed
TargetDual specificity protein phosphatase 1(Mus musculus)
Virginia Polytechnic Institute And State University
Curated by ChEMBL
LigandPNGBDBM50267171(2-(2-hydroxyethylamino)-3-methylnaphthalene-1,4-di...)
Affinity DataIC50: >5.00E+4nM. Assay description: Inhibition of histidine-tagged mouse MKP1 catalytic domain expressed in human Hela cells
In DepthDetails ArticlePubMed