BDBM50267391 4-(hydroxydiphenylmethyl)-1-azoniabicyclo[2.2.2]octane bromide::CHEMBL476436
SMILES OC(c1ccccc1)(c1ccccc1)C12CC[NH+](CC1)CC2
InChI Key InChIKey=VUUAKOZGGDHCRP-UHFFFAOYSA-O
Data  1 IC50
  Tab Delimited (TSV)   2D SDfile   Computed 3D by Vconf -m prep SDfile
Find this compound or compounds like it in BindingDB:
Activity Spreadsheet -- Enzyme Inhibition Constant Data from BindingDB
Found 1 hit for monomerid = 50267391
TargetMuscarinic acetylcholine receptor M3(Homo sapiens (Human))
Glaxosmithkline
Curated by ChEMBL
LigandPNGBDBM50267391(4-(hydroxydiphenylmethyl)-1-azoniabicyclo[2.2.2]oc...)
Affinity DataIC50:  1.07E+6nM. Assay description: Antagonist activity at human cloned muscarinic M3 receptor expressed in CHO cells assessed as inhibition of acetylcholine-induced calcium mobilizatio...
In DepthDetails ArticlePubMed