BDBM50267423 CHEMBL4075324
SMILES CCOP(=O)(OCC)C(CO)CCCCc1ccccc1
InChI Key InChIKey=STMXZOFMXPPVCH-UHFFFAOYSA-N
Data  2 IC50
  Tab Delimited (TSV)   2D SDfile   Computed 3D by Vconf -m prep SDfile
Find this compound or compounds like it in BindingDB:
Activity Spreadsheet -- Enzyme Inhibition Constant Data from BindingDB
Found 2 hits for monomerid = 50267423
TargetMetallo-beta-lactamase GIM-1(Pseudomonas aeruginosa)
Uit The Arctic University Of Norway
Curated by ChEMBL
LigandPNGBDBM50267423(CHEMBL4075324)
Affinity DataIC50:  2.80E+5nM. Assay description: Inhibition of Pseudomonas aeruginosa 6His-tagged GIM-1 (Q19 to D250 residues) expressed in Escherichia coli BL21 Star(DE3) pLysS using nitrocefin as ...
In DepthDetails ArticlePubMed
TargetVIM-2 type metallo-beta-lactamase(Pseudomonas aeruginosa)
Uit The Arctic University Of Norway
Curated by ChEMBL
LigandPNGBDBM50267423(CHEMBL4075324)
Affinity DataIC50: >1.00E+4nM. Assay description: Inhibition of Pseudomonas aeruginosa 301-5473 6His-tagged VIM-2 (V27 to E268 residues) expressed in Escherichia coli BL21 Star(DE3) pLysS using nitro...
In DepthDetails ArticlePubMed