BDBM50267426 CHEMBL4061495
SMILES OP(O)(=O)C(CS)CCCCc1ccccc1
InChI Key InChIKey=WYMCBVFBZXZFAG-UHFFFAOYSA-N
Data  2 IC50
  Tab Delimited (TSV)   2D SDfile   Computed 3D by Vconf -m prep SDfile
Find this compound or compounds like it in BindingDB:
Activity Spreadsheet -- Enzyme Inhibition Constant Data from BindingDB
Found 2 hits for monomerid = 50267426
TargetMetallo-beta-lactamase GIM-1(Pseudomonas aeruginosa)
Uit The Arctic University Of Norway
Curated by ChEMBL
LigandPNGBDBM50267426(CHEMBL4061495)
Affinity DataIC50:  1.60E+4nM. Assay description: Inhibition of Pseudomonas aeruginosa 6His-tagged GIM-1 (Q19 to D250 residues) expressed in Escherichia coli BL21 Star(DE3) pLysS using nitrocefin as ...
In DepthDetails ArticlePubMed
TargetVIM-2 type metallo-beta-lactamase(Pseudomonas aeruginosa)
Uit The Arctic University Of Norway
Curated by ChEMBL
LigandPNGBDBM50267426(CHEMBL4061495)
Affinity DataIC50:  8.60E+3nM. Assay description: Inhibition of Pseudomonas aeruginosa 301-5473 6His-tagged VIM-2 (V27 to E268 residues) expressed in Escherichia coli BL21 Star(DE3) pLysS using nitro...
In DepthDetails ArticlePubMed