BDBM50269648 CHEMBL1967666
SMILES Cc1cc(ccc1\C=N\NC(=O)Cc1cc(=O)oc2cc(O)ccc12)N(CCCl)CCCl
InChI Key InChIKey=WCRKUBGTWMEDDH-VULFUBBASA-N
Data  1 Kd
  Tab Delimited (TSV)   2D SDfile   Computed 3D by Vconf -m prep SDfile
Find this compound or compounds like it in BindingDB:
Activity Spreadsheet -- Enzyme Inhibition Constant Data from BindingDB
Found 1 hit for monomerid = 50269648
TargetMyocilin(Homo sapiens)
Georgia Institute Of Technology
Curated by ChEMBL
LigandPNGBDBM50269648(CHEMBL1967666)
Affinity DataKd:  2.10E+5nM. Assay description: Binding affinity myocilin-OLF domain (unknown origin) by Sypro Orange dye-based DSF assay
In DepthDetails ArticlePubMed