BDBM50269649 CHEMBL1594682
SMILES OC(=O)c1ccc(NC(=O)Cn2ccc(=O)[nH]c2=O)cc1O
InChI Key InChIKey=CSMIMYLGRREXAC-UHFFFAOYSA-N
Data  1 Kd
  Tab Delimited (TSV)   2D SDfile   Computed 3D by Vconf -m prep SDfile
Find this compound or compounds like it in BindingDB:
Activity Spreadsheet -- Enzyme Inhibition Constant Data from BindingDB
Found 1 hit for monomerid = 50269649
TargetMyocilin(Homo sapiens)
Georgia Institute Of Technology
Curated by ChEMBL
LigandPNGBDBM50269649(CHEMBL1594682)
Affinity DataKd:  2.00E+5nM. Assay description: Binding affinity myocilin-OLF domain (unknown origin) by Sypro Orange dye-based DSF assay
In DepthDetails ArticlePubMed