BDBM50269652 CHEMBL1979155
SMILES [O-][N+](=O)c1ccc(cc1)C(C1C(=O)c2ccccc2C1=O)C1C(=O)c2ccccc2C1=O
InChI Key InChIKey=IMSFIAWRQCLBNS-UHFFFAOYSA-N
Data  1 Kd
  Tab Delimited (TSV)   2D SDfile   Computed 3D by Vconf -m prep SDfile
Find this compound or compounds like it in BindingDB:
Activity Spreadsheet -- Enzyme Inhibition Constant Data from BindingDB
Found 1 hit for monomerid = 50269652
TargetMyocilin(Homo sapiens)
Georgia Institute Of Technology
Curated by ChEMBL
LigandPNGBDBM50269652(CHEMBL1979155)
Affinity DataKd:  1.70E+5nM. Assay description: Binding affinity myocilin-OLF domain (unknown origin) by Sypro Orange dye-based DSF assay
In DepthDetails ArticlePubMed