BDBM50269820 13,16-epoxy-25-hydroxy-17-cheilanthen-19,25-olide::CHEMBL476478
SMILES C[C@]12CC[C@H]3[C@@](C)(CC[C@H]4C(C)(C)CCC[C@]34C)[C@@H]1C[C@@H](O2)C1=CC(=O)OC1O
InChI Key InChIKey=NSNPNVMHENRPQH-BPXGIISOSA-N
Data  2 IC50
  Tab Delimited (TSV)   2D SDfile   Computed 3D by Vconf -m prep SDfile
Find this compound or compounds like it in BindingDB:
Activity Spreadsheet -- Enzyme Inhibition Constant Data from BindingDB
Found 2 hits for monomerid = 50269820
TargetMAP kinase-activated protein kinase 2(Homo sapiens (Human))
Astrazeneca R&D Griffith University
Curated by ChEMBL
LigandPNGBDBM50269820(13,16-epoxy-25-hydroxy-17-cheilanthen-19,25-olide ...)
Affinity DataIC50:  9.00E+4nM. Assay description: Inhibition of MAPKAPK2 (unknown origin) assessed as [33P] incorporation by scintillation proximity assay
In DepthDetails ArticlePubMed
TargetRibosomal protein S6 kinase alpha-5(Homo sapiens (Human))
Astrazeneca R&D Griffith University
Curated by ChEMBL
LigandPNGBDBM50269820(13,16-epoxy-25-hydroxy-17-cheilanthen-19,25-olide ...)
Affinity DataIC50:  4.00E+3nM. Assay description: Inhibition of MSK1 (unknown origin) assessed as [33P] incorporation by scintillation proximity assay
In DepthDetails ArticlePubMed