BDBM50270016 CHEMBL4070320
SMILES C(NCC1CCOCC1)\C=C\CN(C[C@H]1Cc2ccccc2CN1)[C@H]1CCCc2cccnc12
InChI Key InChIKey=NPGGQYKPWKEPMR-FENCIZKFSA-N
Data  7 IC50  1 EC50
  Tab Delimited (TSV)   2D SDfile   Computed 3D by Vconf -m prep SDfile
Find this compound or compounds like it in BindingDB:
Activity Spreadsheet -- Enzyme Inhibition Constant Data from BindingDB
Found 8 hits for monomerid = 50270016
TargetCytochrome P450 2C9(Homo sapiens (Human))
Emory University
Curated by ChEMBL
LigandPNGBDBM50270016(CHEMBL4070320)
Affinity DataIC50: <5.00E+3nM. Assay description: Inhibition of CYP2C9 (unknown origin)
In DepthDetails ArticlePubMed
TargetC-X-C chemokine receptor type 4(Homo sapiens (Human))
Emory University
Curated by ChEMBL
LigandPNGBDBM50270016(CHEMBL4070320)
Affinity DataIC50:  24nM. Assay description: Antagonist activity at human CXCR4 in CCRF-CEM cells assessed as decrease in SDF-1alpha stimulated Ca2+ flux preincubated for 25 mins followed by SDF...
In DepthDetails ArticlePubMed
TargetC-X-C chemokine receptor type 4(Mus musculus)
Emory University
Curated by ChEMBL
LigandPNGBDBM50270016(CHEMBL4070320)
Affinity DataIC50:  5.5nM. Assay description: Antagonist activity at mouse CXCR4
In DepthDetails ArticlePubMed
TargetC-X-C chemokine receptor type 4(Homo sapiens (Human))
Emory University
Curated by ChEMBL
LigandPNGBDBM50270016(CHEMBL4070320)
Affinity DataEC50: >3.00E+4nM. Assay description: Antagonist activity at human CXCR4 in CCRF-CEM cells assessed as decrease in SDF-1alpha stimulated Ca2+ flux preincubated for 25 mins followed by SDF...
In DepthDetails ArticlePubMed
TargetCytochrome P450 3A4(Homo sapiens (Human))
Emory University
Curated by ChEMBL
LigandPNGBDBM50270016(CHEMBL4070320)
Affinity DataIC50: >2.00E+4nM. Assay description: Inhibition of CYP3A4 (unknown origin)
In DepthDetails ArticlePubMed
TargetCytochrome P450 2C19(Homo sapiens (Human))
Emory University
Curated by ChEMBL
LigandPNGBDBM50270016(CHEMBL4070320)
Affinity DataIC50: <5.00E+3nM. Assay description: Inhibition of CYP2C19 (unknown origin)
In DepthDetails ArticlePubMed
TargetCytochrome P450 2C8(Homo sapiens (Human))
Emory University
Curated by ChEMBL
LigandPNGBDBM50270016(CHEMBL4070320)
Affinity DataIC50: <5.00E+3nM. Assay description: Inhibition of CYP2C8 (unknown origin)
In DepthDetails ArticlePubMed
TargetCytochrome P450 2D6(Homo sapiens (Human))
Emory University
Curated by ChEMBL
LigandPNGBDBM50270016(CHEMBL4070320)
Affinity DataIC50:  3.32E+3nM. Assay description: Inhibition of recombinant human CYP2D6 expressed in microsomes of insect cells using AMMC as substrate preincubated for 30 mins followed by NADP addi...
In DepthDetails ArticlePubMed