BDBM50270656 2-(1-(3-(6-chloronaphthalen-2-ylsulfonyl)propanoyl)piperidin-4-yl)-5-methyl-1,2-dihydroimidazo[1,5-e]imidazol-3-one::2-(1-(3-(6-chloronaphthalen-2-ylsulfonyl)propanoyl)piperidin-4-yl)-5-methyl-1H-imidazo[1,5-c]imidazol-3(2H)-one::CHEMBL487105
SMILES Cc1ncc2CN(C3CCN(CC3)C(=O)CCS(=O)(=O)c3ccc4cc(Cl)ccc4c3)C(=O)n12
InChI Key InChIKey=WDOQRMZARYWHDS-UHFFFAOYSA-N
Data  4 KI  3 IC50
  Tab Delimited (TSV)   2D SDfile   Computed 3D by Vconf -m prep SDfile
Find this compound or compounds like it in BindingDB:
Activity Spreadsheet -- Enzyme Inhibition Constant Data from BindingDB
Found 7 hits for monomerid = 50270656
TargetCoagulation factor X(Homo sapiens (Human))
Bristol-Myers Squibb
Curated by ChEMBL
LigandPNGBDBM50270656(2-(1-(3-(6-chloronaphthalen-2-ylsulfonyl)propanoyl...)
Affinity DataKi:  2nM. Assay description: Inhibition of factor 10a
In DepthDetails ArticlePubMed
TargetProthrombin(Homo sapiens (Human))
Takeda Pharmaceutical
Curated by ChEMBL
LigandPNGBDBM50270656(2-(1-(3-(6-chloronaphthalen-2-ylsulfonyl)propanoyl...)
Affinity DataKi:  6.20E+3nM. Assay description: Inhibition of thrombin (unknown origin)
In DepthDetails ArticlePubMed
TargetPlasminogen(Homo sapiens (Human))
Takeda Pharmaceutical
Curated by ChEMBL
LigandPNGBDBM50270656(2-(1-(3-(6-chloronaphthalen-2-ylsulfonyl)propanoyl...)
Affinity DataKi: >6.00E+4nM. Assay description: Inhibition of plasmin (unknown origin)
In DepthDetails ArticlePubMed
TargetTissue-type plasminogen activator(Homo sapiens (Human))
Takeda Pharmaceutical
Curated by ChEMBL
LigandPNGBDBM50270656(2-(1-(3-(6-chloronaphthalen-2-ylsulfonyl)propanoyl...)
Affinity DataKi: >6.00E+4nM. Assay description: Inhibition of tPA (unknown origin)
In DepthDetails ArticlePubMed
TargetCoagulation factor X(Homo sapiens (Human))
Bristol-Myers Squibb
Curated by ChEMBL
LigandPNGBDBM50270656(2-(1-(3-(6-chloronaphthalen-2-ylsulfonyl)propanoyl...)
Affinity DataIC50:  4.80nM. Assay description: Inhibition of human factor 10a assessed as p-nitroanilide release using S2765 as substrate by chromogenic assay
In DepthDetails ArticlePubMed
TargetCoagulation factor X(Homo sapiens (Human))
Bristol-Myers Squibb
Curated by ChEMBL
LigandPNGBDBM50270656(2-(1-(3-(6-chloronaphthalen-2-ylsulfonyl)propanoyl...)
Affinity DataIC50:  4.80nM. Assay description: Inhibition of human factor 10a by para-nitroanilide release assay
In DepthDetails ArticlePubMed
TargetCoagulation factor X(Homo sapiens (Human))
Bristol-Myers Squibb
Curated by ChEMBL
LigandPNGBDBM50270656(2-(1-(3-(6-chloronaphthalen-2-ylsulfonyl)propanoyl...)
Affinity DataIC50:  4.80nM. Assay description: Inhibition of human factor 10a
In DepthDetails ArticlePubMed