BDBM50270735 6-Iodo-4-{[4-(5-methyl-2,5-diaza-bicyclo[2.2.1]hept-2-yl)-phenylamino]-methylene}-4H-isoquinoline-1,3-dione::CHEMBL488128
SMILES CN1CC2CC1CN2c1ccc(NC=C2C(=O)NC(=O)c3ccc(I)cc23)cc1
InChI Key InChIKey=YTKPRFGZAQKROC-UHFFFAOYSA-N
Data  3 IC50
  Tab Delimited (TSV)   2D SDfile   Computed 3D by Vconf -m prep SDfile
Find this compound or compounds like it in BindingDB:
Activity Spreadsheet -- Enzyme Inhibition Constant Data from BindingDB
Found 3 hits for monomerid = 50270735
TargetCyclin-dependent kinase 4(Homo sapiens (Human))
Wyeth Research
Curated by ChEMBL
LigandPNGBDBM50270735(6-Iodo-4-{[4-(5-methyl-2,5-diaza-bicyclo[2.2.1]hep...)
Affinity DataIC50:  320nM. Assay description: Inhibition of CDK4/cyclin D1 (unknown origin) expressed in Sf9 cells-baculovirus system assessed as retinoblastoma susceptibility gene product phosph...
In DepthDetails ArticlePubMed
TargetCyclin-dependent kinase 2(Homo sapiens (Human))
Wyeth Research
Curated by ChEMBL
LigandPNGBDBM50270735(6-Iodo-4-{[4-(5-methyl-2,5-diaza-bicyclo[2.2.1]hep...)
Affinity DataIC50: >5.00E+4nM. Assay description: Inhibition of CDK2/cyclin E (unknown origin) expressed in Sf9 cells-baculovirus system assessed as retinoblastoma susceptibility gene product phospho...
In DepthDetails ArticlePubMed
TargetCyclin-dependent kinase 1(Homo sapiens (Human))
Wyeth Research
Curated by ChEMBL
LigandPNGBDBM50270735(6-Iodo-4-{[4-(5-methyl-2,5-diaza-bicyclo[2.2.1]hep...)
Affinity DataIC50: >5.00E+4nM. Assay description: Inhibition of CDK1/Cyclin B1 (unknown origin) expressed in Sf9 cells-baculovirus system assessed as retinoblastoma susceptibility gene product phosph...
In DepthDetails ArticlePubMed